{"text_format":"1","workbook":"xlsx","n_sheets":11,"sheets":["Usmernenie","Príklady","Príjmy","Spolu","Doklady","Adr","FP","Cis","Avízo_-_výnosy","Avízo_-_vratka","Skratky"],"not_rendered":{"charts":0,"images":0,"macros":0,"external_links":0,"defined_names":10,"comments":3,"pivot_tables":0},"unopened":[],"bounds":{"document_bytes":16777216,"sheet_cells":100000,"rows_first":2000,"rows_last":500,"rows_between":2000,"halvings":0,"cell_chars":16384,"cell_head_chars":4096},"cells_cut":0,"cells_raw":0,"read":"whole","date_system":"1900"}

{"sheet":"Usmernenie","index":0,"n_rows":143,"n_cols":4,"rows_kept":143,"cut":false,"hidden":false,"merged":[[0,2,0,3],[17,2,17,3],[18,2,18,3],[20,2,20,3]]}
["Usmernenie k priebežnému čerpaniu a vyúčtovaniu finančných prostriedkov poskytnutých v roku 2023"]
[]
["Základné pokyny"]
["1. Vložiť údaje do hárkov \"Príjmy\" a \"Doklady\"."]
["2. Skontrolovať hárky \"Doklady\" a \"Spolu\"."]
["3. Po kontrole odoslať elektronickú verziu formuláru na adresu ziadosti.sport@minedu.sk."]
["4. Vyplniť hárok  \"Avízo - vratka\" (len Prijímatelia, ktorí nevyčerpali celú sumu)."]
["5. Vytlačiť hárky \"Spolu\", \"Doklady\", \"Avízo - vratka\"."]
["6. Dopísať do hárku \"Spolu\" dátum a čas odoslania elektronickej verzie formuláru vyúčtovania."]
["7. Podpísať všetky hárky štatutárnym zástupcom a kontrolórom športovej organizácie v prípade, ak je zriadený podľa  § 10 ods. 1 Zákona č. 440/2015 Z. z.  o športe a o zmene a doplnení niektorých zákonov v znení neskorších predpisov (v súlade so stanovami), prípadne podľa pokynov na hárku.   "]
{"$rows_left_out":134}
{"sheet":"Príklady","index":1,"n_rows":76,"n_cols":9,"rows_kept":76,"cut":false,"hidden":false,"merged":[[0,0,0,7],[1,0,1,6],[1,7,1,8],[2,7,2,8],[3,1,3,4]]}
["Príklady vyplnenia formulára"]
["Priebežné čerpanie finančných prostriedkov poskytnutých zo štátneho rozpočtu v oblasti športu v roku 2023",null,null,null,null,null,null,{"$f":"+Doklady!I100","v":"V4"}]
[null,null,null,null,null,null,null,{"$f":"+Doklady!I101","v":"2024-01-25"}]
["Prijímateľ dotácie:","Slovenský zväz skúšobný"]
[]
[]
["Účel úhrady\n(vyberte zo zoznamu, inak automatické vyhodnocovanie nebude fungovať)","Interné číslo účtovného dokladu","Číslo externého (originálneho)\núčtovného dokladu","Dátum skutočnej úhrady účtovného dokladu","Popis úhrady\n(vyberte z rozbaľovacieho zoznamu, alebo zadajte voľný text)","IČO \ndodávateľa\nplnenia","Dodávateľ plnenia","Skutočne uhradená suma\n(eur)","AK"]
["a - kriket - bežné výdavky",null,null,"2023-05-02","Organizovanie podujatia\nNázov podujatia: Svetový pohár v skúškach\nMiesto konania: Brezno\nTermín: 15. - 18.4.2023\nPočet zúčastnených osôb (okrem divákov): 20\n"]
["a - kriket - bežné výdavky","123/2023","CP14-110","2023-05-03","počet odpracovaných hodín spolu: 100\nhrubé mzdy vyplatené osobám v súvislosti s podujatím vrátane odvodov zamestnávateľa spolu (dohody, zmluvy, faktúry, a pod.) v eur",null,"osoba 1 - osoba 20",400,3]
["a - kriket - bežné výdavky","124/2023","DF 24","2023-05-04","náklady na ubytovanie 10 športovcov + 1 tréner",null,"Chata Breznovčan",null,3]
{"$rows_left_out":67}
{"sheet":"Príjmy","index":2,"n_rows":61,"n_cols":7,"rows_kept":61,"cut":false,"hidden":false,"merged":[[0,0,0,1],[2,1,2,3],[16,0,16,3]]}
["Aktualizovaná suma prostriedkov poskytnutých ministerstvom k  dátumu",null,"2023-12-31",null,null,null,"2023-01-31"]
[null,null,null,null,null,null,"2023-02-28"]
["Prijímateľ",{"$f":"INDEX(Adr!B:B,Doklady!B102+1)","v":"Slovenský zväz vodného lyžovania a wakeboardingu"},null,null,null,null,"2023-03-31"]
["IČO:",{"$f":"RIGHT(\"0000\"&INDEX(Adr!A:A,Doklady!B102+1),8)","v":"30793203"},null,null,null,null,"2023-04-30"]
["Sídlo:",{"$f":"INDEX(Adr!D:D,Doklady!B102+1)&\", \"&INDEX(Adr!E:E,Doklady!B102+1)","v":"Junácka 6, Bratislava"},null,null,null,null,"2023-05-31"]
[null,null,null,null,null,null,"2023-06-30"]
[null,null,null,null,null,null,"2023-07-31"]
[null,null,null,null,null,null,"2023-08-31"]
["PPG","PPG","Poskytnuté prostriedky",null,null,null,"2023-09-30"]
["026 01","Šport pre všetkých, školský a univerzitný šport",{"$f":"+Spolu!C10","v":0},null,null,null,"2023-10-31"]
{"$rows_left_out":52}
{"sheet":"Spolu","index":3,"n_rows":81,"n_cols":21,"rows_kept":81,"cut":false,"hidden":false,"merged":[[11,4,11,5],[0,0,0,8],[2,2,2,5],[8,4,8,5],[9,4,9,5],[10,4,10,5],[24,1,24,7],[12,4,12,5],[13,4,13,5],[15,1,15,7],[16,1,16,7],[17,1,17,7],[18,1,18,7],[19,1,19,7],[20,1,20,7],[21,1,21,7],[22,1,22,7],[23,1,23,7],[78,3,78,8],[25,1,25,7],[26,1,26,7],[27,1,27,7],[28,1,28,7],[29,1,29,7],[30,1,30,7],[31,1,31,7],[32,1,32,7],[33,1,33,7],[49,0,49,8],[77,3,77,8]]}
["Priebežné čerpanie a vyúčtovanie finančných prostriedkov poskytnutých zo štátneho rozpočtu v oblasti športu v roku 2023"]
[]
[null,"Prijímateľ dotácie:",{"$f":"INDEX(Adr!B2:B103,Doklady!B102)","v":"Slovenský zväz vodného lyžovania a wakeboardingu"},null,null,null,null,null,{"$f":"Doklady!I100","v":"V4"}]
[null,"IČO:",{"$f":"INDEX(Adr!A2:A154,Doklady!B102)","v":"30793203"},null,null,null,null,null,{"$f":"Doklady!I101","v":"2024-01-25"}]
[null,"Právna forma:",{"$f":"INDEX(Adr!C2:C154,Doklady!B102)","v":"občianske združenie"}]
[null,"Sídlo:",{"$f":"INDEX(Adr!D2:D154,Doklady!B102)&\", \"&INDEX(Adr!E2:E154,Doklady!B102)&\", \"&INDEX(Adr!F2:F154,Doklady!B102)","v":"Junácka 6, Bratislava, 832 80"}]
[]
[]
["PPG","Podprogram","Poskytnuté\n(eur)","Vyúčtované\n(eur)","Povinnosť\nvrátiť\n(eur)"]
["026 01","Šport pre všetkých, školský a univerzitný šport",{"$f":"SUMIF(FP!J:J,Doklady!$B$1&A10,FP!D:D)","v":0},{"$f":"C10-E10","v":0},{"$f":"SUMIF(K:K,A10,I:I)","v":0},null,null,null,null,null,null,"AAA"]
{"$rows_left_out":72}
{"sheet":"Doklady","index":4,"n_rows":259,"n_cols":14,"rows_kept":259,"cut":false,"hidden":false,"merged":[[99,0,99,7],[99,8,99,9],[100,0,100,7],[100,8,100,9],[104,0,104,9]]}
[{"$f":"IF(ROW()<=B$3,INDEX(FP!F:F,B$2+ROW()-1)&\" - \"&INDEX(FP!C:C,B$2+ROW()-1),\"\")","v":"a - vodné lyžovanie - bežné transfery"},{"$f":"INDEX(Adr!A:A,B102+1)","v":"30793203"},{"$f":"IF(ROW()<=B$3,INDEX(FP!E:E,B$2+ROW()-1),\"\")","v":0},{"$f":"IF(ROW()<=B$3,INDEX(FP!F:F,B$2+ROW()-1),\"\")","v":"a"},null,{"$f":"IF(ROW()<=B$3,INDEX(FP!G:G,B$2+ROW()-1),\"\")","v":"026 02"},null,{"$f":"IF(ROW()<=B$3,INDEX(FP!C:C,B$2+ROW()-1),\"\")","v":"vodné lyžovanie - bežné transfery"},{"$f":"IF(ROW()<=B$3,SUMIF(A$107:A$10065,A1,I$107:I$10065),\"\")","v":76898},{"$f":"IF(ROW()<=B$3,SUMIFS(I$103:I$50065,A$103:A$50065,K1,J$103:J$50065,L1),\"\")","v":0},null,99]
[{"$f":"IF(ROW()<=B$3,INDEX(FP!F:F,B$2+ROW()-1)&\" - \"&INDEX(FP!C:C,B$2+ROW()-1),\"\")","v":""},{"$f":"MATCH(B1,FP!A:A,0)","v":463},{"$f":"IF(ROW()<=B$3,INDEX(FP!E:E,B$2+ROW()-1),\"\")","v":""},{"$f":"IF(ROW()<=B$3,INDEX(FP!F:F,B$2+ROW()-1),\"\")","v":""},null,{"$f":"IF(ROW()<=B$3,INDEX(FP!G:G,B$2+ROW()-1),\"\")","v":""},null,{"$f":"IF(ROW()<=B$3,INDEX(FP!C:C,B$2+ROW()-1),\"\")","v":""},"","",null,99,"AAA","HHH"]
[{"$f":"IF(ROW()<=B$3,INDEX(FP!F:F,B$2+ROW()-1)&\" - \"&INDEX(FP!C:C,B$2+ROW()-1),\"\")","v":""},{"$f":"COUNTIF(FP!A:A,Doklady!B1)","v":1},{"$f":"IF(ROW()<=B$3,INDEX(FP!E:E,B$2+ROW()-1),\"\")","v":""},{"$f":"IF(ROW()<=B$3,INDEX(FP!F:F,B$2+ROW()-1),\"\")","v":""},null,{"$f":"IF(ROW()<=B$3,INDEX(FP!G:G,B$2+ROW()-1),\"\")","v":""},null,{"$f":"IF(ROW()<=B$3,INDEX(FP!C:C,B$2+ROW()-1),\"\")","v":""},"","",null,99,{"$f":"$A2","v":""},99]
[{"$f":"IF(ROW()<=B$3,INDEX(FP!F:F,B$2+ROW()-1)&\" - \"&INDEX(FP!C:C,B$2+ROW()-1),\"\")","v":""},null,{"$f":"IF(ROW()<=B$3,INDEX(FP!E:E,B$2+ROW()-1),\"\")","v":""},{"$f":"IF(ROW()<=B$3,INDEX(FP!F:F,B$2+ROW()-1),\"\")","v":""},null,{"$f":"IF(ROW()<=B$3,INDEX(FP!G:G,B$2+ROW()-1),\"\")","v":""},null,{"$f":"IF(ROW()<=B$3,INDEX(FP!C:C,B$2+ROW()-1),\"\")","v":""},"","",null,99,"AAA","HHH"]
[{"$f":"IF(ROW()<=B$3,INDEX(FP!F:F,B$2+ROW()-1)&\" - \"&INDEX(FP!C:C,B$2+ROW()-1),\"\")","v":""},null,{"$f":"IF(ROW()<=B$3,INDEX(FP!E:E,B$2+ROW()-1),\"\")","v":""},{"$f":"IF(ROW()<=B$3,INDEX(FP!F:F,B$2+ROW()-1),\"\")","v":""},null,{"$f":"IF(ROW()<=B$3,INDEX(FP!G:G,B$2+ROW()-1),\"\")","v":""},null,{"$f":"IF(ROW()<=B$3,INDEX(FP!C:C,B$2+ROW()-1),\"\")","v":""},"","",null,99,{"$f":"$A4","v":""},99]
[{"$f":"IF(ROW()<=B$3,INDEX(FP!F:F,B$2+ROW()-1)&\" - \"&INDEX(FP!C:C,B$2+ROW()-1),\"\")","v":""},null,{"$f":"IF(ROW()<=B$3,INDEX(FP!E:E,B$2+ROW()-1),\"\")","v":""},{"$f":"IF(ROW()<=B$3,INDEX(FP!F:F,B$2+ROW()-1),\"\")","v":""},null,{"$f":"IF(ROW()<=B$3,INDEX(FP!G:G,B$2+ROW()-1),\"\")","v":""},null,{"$f":"IF(ROW()<=B$3,INDEX(FP!C:C,B$2+ROW()-1),\"\")","v":""},"","",null,99,"AAA","HHH"]
[{"$f":"IF(ROW()<=B$3,INDEX(FP!F:F,B$2+ROW()-1)&\" - \"&INDEX(FP!C:C,B$2+ROW()-1),\"\")","v":""},null,{"$f":"IF(ROW()<=B$3,INDEX(FP!E:E,B$2+ROW()-1),\"\")","v":""},{"$f":"IF(ROW()<=B$3,INDEX(FP!F:F,B$2+ROW()-1),\"\")","v":""},null,{"$f":"IF(ROW()<=B$3,INDEX(FP!G:G,B$2+ROW()-1),\"\")","v":""},null,{"$f":"IF(ROW()<=B$3,INDEX(FP!C:C,B$2+ROW()-1),\"\")","v":""},"","",null,99,{"$f":"$A6","v":""},99]
[{"$f":"IF(ROW()<=B$3,INDEX(FP!F:F,B$2+ROW()-1)&\" - \"&INDEX(FP!C:C,B$2+ROW()-1),\"\")","v":""},null,{"$f":"IF(ROW()<=B$3,INDEX(FP!E:E,B$2+ROW()-1),\"\")","v":""},{"$f":"IF(ROW()<=B$3,INDEX(FP!F:F,B$2+ROW()-1),\"\")","v":""},null,{"$f":"IF(ROW()<=B$3,INDEX(FP!G:G,B$2+ROW()-1),\"\")","v":""},null,{"$f":"IF(ROW()<=B$3,INDEX(FP!C:C,B$2+ROW()-1),\"\")","v":""},"","",null,99,"AAA","HHH"]
[{"$f":"IF(ROW()<=B$3,INDEX(FP!F:F,B$2+ROW()-1)&\" - \"&INDEX(FP!C:C,B$2+ROW()-1),\"\")","v":""},null,{"$f":"IF(ROW()<=B$3,INDEX(FP!E:E,B$2+ROW()-1),\"\")","v":""},{"$f":"IF(ROW()<=B$3,INDEX(FP!F:F,B$2+ROW()-1),\"\")","v":""},null,{"$f":"IF(ROW()<=B$3,INDEX(FP!G:G,B$2+ROW()-1),\"\")","v":""},null,{"$f":"IF(ROW()<=B$3,INDEX(FP!C:C,B$2+ROW()-1),\"\")","v":""},"","",null,99,{"$f":"$A8","v":""},99]
[{"$f":"IF(ROW()<=B$3,INDEX(FP!F:F,B$2+ROW()-1)&\" - \"&INDEX(FP!C:C,B$2+ROW()-1),\"\")","v":""},null,{"$f":"IF(ROW()<=B$3,INDEX(FP!E:E,B$2+ROW()-1),\"\")","v":""},{"$f":"IF(ROW()<=B$3,INDEX(FP!F:F,B$2+ROW()-1),\"\")","v":""},null,{"$f":"IF(ROW()<=B$3,INDEX(FP!G:G,B$2+ROW()-1),\"\")","v":""},null,{"$f":"IF(ROW()<=B$3,INDEX(FP!C:C,B$2+ROW()-1),\"\")","v":""},"","",null,99,"AAA","HHH"]
{"$rows_left_out":250}
{"sheet":"Adr","index":5,"n_rows":103,"n_cols":12,"rows_kept":103,"cut":false,"hidden":true,"merged":[]}
["IČO","Subjekt","Právna forma","Ulica a číslo domu","Mesto","PSČ","Webové sídlo","E-mail","Štatutárny zástupca","Štatutár - funkcia","Kontakná osoba","Kontakt\ntelefón"]
["42254388","Deaflympijský výbor Slovenska","občianske združenie","Kýčerského 7","Bratislava 1","811 05","www.deaflympic.sk","office@deaflympic.sk","Peter Birka","prezident","Milena Fabšičová",421911370554]
["50642804","iCompete Natural Slovakia","občianske združenie","Jesenského 71","Zvolen","960 01","www.icn.sk","icn@icn.sk","René Tomášek","prezident","René Tomášek",421905819613]
["00688312","Klub slovenských turistov","občianske združenie","Záborského 33","Bratislava 3","831 03","www.kst.sk","ustredie@kst.sk","František Šiller","predseda","Marica Žáková",421910448008]
["47845660","Košická Futbalová Aréna a. s.","akciová spoločnosť","Pri prachárni 13","Košice – mestská časť Juh","040 11","www.kosickafutbalovaarena.sk","office@kosickafutbalovaarena.sk","Marcel Gibóda, Stanislav Petráš","predseda predstavenstva, člen predstavenstva",0,0]
["42269423","MAMMAL - Slovenský zväz MMA","občianske združenie","Židovská 298/19","Bratislava 1","811 01","www.mammal.sk","info@mammal.sk; marek.herda@mammal.sk","Marek Herda","prezident","Jana Gurová",421903555547]
["00595209","Maratónsky klub Košice","občianske združenie","Hroncova 2","Košice","040 01","www.kosicemarathon.com","klub@kosicemarathon.com","Ján Sudzina","prezident",0,0]
["30787009","Slovenská asociácia amerického futbalu, o.z.","občianske združenie","Nevädzová 17211/6B","Bratislava","821 01","www.saaf.sk","info@saaf.sk","Michal Slašťan","prezident","Michal Slašťan",421908868248]
["50897152","Slovenská Asociácia Bandy, skrátený názov SAB","občianske združenie","Trenčianske Teplice 611/2","Trenčianske Teplice","914 51","www.slovakbandy.sk","slovakbandy@gmail.com","Lukáš Vepy","predseda","Ľudovít Vepy",421917626568]
["00631655","Slovenská asociácia boccie","občianske združenie","Ulica Vajanského 874/46","Lučenec","984 01","www.bocce.sk","slovenska.asociacia.bocce@gmail.com","Ján Macko, Ján Brezňan, Ladislav Mészáros","prezident, predseda, predseda","Ján Macko ",421919188236]
{"$rows_left_out":94}
{"sheet":"FP","index":6,"n_rows":823,"n_cols":14,"rows_kept":823,"cut":false,"hidden":true,"merged":[]}
["IČO","Prijímateľ","Predmet\n(názov, miesto, termín, parametre)","Schválená\n(eur)","SF\n(%)","Účel","PPG","B/K","ico+ucel","ico+ppg","Šport","ICO+PPG+BK","Zoraď","ico+ucel+B/K"]
["42254388",{"$f":"VLOOKUP(A2,Adr!A:B,2,FALSE)","v":"Deaflympijský výbor Slovenska"},"činnosť Deaflympijského výboru Slovenska",329391,0,"c","026 03","B",{"$f":"A2&F2","v":"42254388c"},{"$f":"A2&G2","v":"42254388026 03"},null,{"$f":"A2&G2&H2","v":"42254388026 03B"},{"$f":"B2&F2&H2&C2","v":"Deaflympijský výbor SlovenskacBčinnosť Deaflympijského výboru Slovenska"},{"$f":"+I2&H2","v":"42254388cB"}]
["42254388",{"$f":"VLOOKUP(A3,Adr!A:B,2,FALSE)","v":"Deaflympijský výbor Slovenska"},"Antušeková Martina",20000,0,"d","026 03","B","42254388d","42254388026 03",null,"42254388026 03B","Deaflympijský výbor SlovenskadBAntušeková Martina","42254388dB"]
["42254388",{"$f":"VLOOKUP(A4,Adr!A:B,2,FALSE)","v":"Deaflympijský výbor Slovenska"},"Birošová Tereza",30000,0,"d","026 03","B","42254388d","42254388026 03",null,"42254388026 03B","Deaflympijský výbor SlovenskadBBirošová Tereza","42254388dB"]
["42254388",{"$f":"VLOOKUP(A5,Adr!A:B,2,FALSE)","v":"Deaflympijský výbor Slovenska"},"Jánošíková Jana",20000,0,"d","026 03","B","42254388d","42254388026 03",null,"42254388026 03B","Deaflympijský výbor SlovenskadBJánošíková Jana","42254388dB"]
["42254388",{"$f":"VLOOKUP(A6,Adr!A:B,2,FALSE)","v":"Deaflympijský výbor Slovenska"},"Jelínek Rastislav",41000,0,"d","026 03","B","42254388d","42254388026 03",null,"42254388026 03B","Deaflympijský výbor SlovenskadBJelínek Rastislav","42254388dB"]
["42254388",{"$f":"VLOOKUP(A7,Adr!A:B,2,FALSE)","v":"Deaflympijský výbor Slovenska"},"Jurková Eva",52000,0,"d","026 03","B","42254388d","42254388026 03",null,"42254388026 03B","Deaflympijský výbor SlovenskadBJurková Eva","42254388dB"]
["42254388",{"$f":"VLOOKUP(A8,Adr!A:B,2,FALSE)","v":"Deaflympijský výbor Slovenska"},"Keinath Thomas",52000,0,"d","026 03","B","42254388d","42254388026 03",null,"42254388026 03B","Deaflympijský výbor SlovenskadBKeinath Thomas","42254388dB"]
["42254388",{"$f":"VLOOKUP(A9,Adr!A:B,2,FALSE)","v":"Deaflympijský výbor Slovenska"},"Krištofičová Ivana",40500,0,"d","026 03","B","42254388d","42254388026 03",null,"42254388026 03B","Deaflympijský výbor SlovenskadBKrištofičová Ivana","42254388dB"]
["42254388",{"$f":"VLOOKUP(A10,Adr!A:B,2,FALSE)","v":"Deaflympijský výbor Slovenska"},"Lepótová Amália",20000,0,"d","026 03","B","42254388d","42254388026 03",null,"42254388026 03B","Deaflympijský výbor SlovenskadBLepótová Amália","42254388dB"]
{"$rows_left_out":814}
{"sheet":"Cis","index":7,"n_rows":98,"n_cols":10,"rows_kept":98,"cut":false,"hidden":true,"merged":[]}
["Šport",null,"Účel","Účel rozšírený","Režim","PPG","Transfer",null,"PPG","PPG názov"]
["aikido",null,"a","šport 23 ",1,"026 02","Príspevok uznanému športu",null,"026 01","Šport pre všetkých, školský a univerzitný  šport"]
["americký futbal",null,"b","talenty",1,"026 02","Príspevok uznanému športu",null,"026 02","Uznané športy"]
["atletika",null,"c","reprezentácia",1,"026 02","Príspevok uznanému športu",null,"026 03","Národné športové projekty"]
["automobilový šport",null,"d","administratíva",1,"026 02","Príspevok uznanému športu",null,"026 04","Športová infraštruktúra"]
["bandy hokej",null,"e","ostatné",1,"026 02","Príspevok uznanému športu",null,"026 05","Prierezové činnosti"]
["basebal",null,"f","športovci",2,"026 03","Príspevok šporovcom top tímu"]
["basketbal",null,"g","SOV",3,"026 03","Príspevok Slovenskému olympijskému výboru"]
["baskická pelota",null,"h","SPV",3,"026 03","Príspevok slovenskému paralympijskému výboru"]
["bedminton",null,"i","účasť a mládež",4,"026 03","Dotácia"]
{"$rows_left_out":89}
{"sheet":"Avízo_-_výnosy","index":8,"n_rows":30,"n_cols":16,"rows_kept":30,"cut":false,"hidden":false,"merged":[[21,1,21,2],[0,0,0,2],[2,4,3,5],[11,0,11,2],[13,0,13,2],[14,1,14,2]]}
[{"$f":"Spolu!C3&\", \"&Spolu!C6","v":"Slovenský zväz vodného lyžovania a wakeboardingu, Junácka 6, Bratislava, 832 80"},null,null,null,null,null,null,null,null,null,null,null,null,{"$f":"O1&\" - \"&P1","v":"a - príspevok uznaným športom"},"a","príspevok uznaným športom"]
[null,null,null,null,null,null,null,null,null,null,null,null,null,"b - príspevok Slovenskému olympijskému a športovému výboru","b","príspevok Slovenskému olympijskému a športovému výboru"]
[null,null,null,null,"1. VYPLŇTE ZELENÉ BUNKY\n2. VYTLAČTE, PODPÍŠTE A ODOŠLITE V LISTINNEJ PODOBE",null,null,null,null,null,null,null,null,"c - príspevok Slovenskému paralympijskému výboru","c","príspevok Slovenskému paralympijskému výboru"]
[null,null,null,null,null,null,null,null,null,null,null,null,null,"d - príspevok športovcom top tímu","d","príspevok športovcom top tímu"]
[null,null,"Ministerstvo školstva, vedy, výskumu a športu Slovenskej republiky",null,null,null,null,null,null,null,null,null,null,"e - rozvoj športov, ktoré nie sú uznanými podľa zákona č. 440/2015 Z. z.","e","rozvoj športov, ktoré nie sú uznanými podľa zákona č. 440/2015 Z. z."]
[null,null,"sekcia športu ",null,"Dátum poukázania vrátených prostriedkov:",null,null,null,null,null,null,null,null,"f - organizovanie významných a tradičných športových podujatí na území SR v roku 2020","f","organizovanie významných a tradičných športových podujatí na území SR v roku 2020"]
[null,null,"Stromová 1",null,"Suma vrátených prostriedkov (eur):",null,null,null,null,null,null,null,null,"g - projekty školského, univerzitného športu a športu pre všetkých","g","projekty školského, univerzitného športu a športu pre všetkých"]
[null,null,"813 30  Bratislava 1",null,"IBAN odosielajúceho účtu:",null,null,null,null,null,null,null,null,"h - podpora a rozvoj turistických a cykloturistických trás","h","podpora a rozvoj turistických a cykloturistických trás"]
[null,null,null,null,"Dátum odoslania AVÍZA:",null,null,null,null,null,null,null,null,"i - finančné odmeny športovcom za výsledky dosiahnuté v roku 2019 a trénerom mládeže za dosiahnuté výsledky ich športovcov v roku 2019 a za celoživotnú prácu s mládežou","i","finančné odmeny športovcom za výsledky dosiahnuté v roku 2019 a trénerom mládeže za dosiahnuté výsledky ich športovcov v roku 2019 a za celoživotnú prácu s mládežou"]
[null,null,null,null,null,null,null,null,null,null,null,null,null,"j - projekty pre popularizáciu pohybových aktivít detí, mládeže a seniorov","j","projekty pre popularizáciu pohybových aktivít detí, mládeže a seniorov"]
{"$rows_left_out":21}
{"sheet":"Avízo_-_vratka","index":9,"n_rows":30,"n_cols":16,"rows_kept":30,"cut":false,"hidden":false,"merged":[[23,1,23,2],[0,0,0,2],[2,4,3,5],[11,0,11,2],[12,0,12,2],[13,1,13,2],[14,1,14,2],[14,5,16,5]]}
[{"$f":"Spolu!C3&\", \"&Spolu!C6","v":"Slovenský zväz vodného lyžovania a wakeboardingu, Junácka 6, Bratislava, 832 80"},null,null,null,null,null,null,null,null,null,null,null,null,{"$f":"O1&\" - \"&P1","v":"a - príspevok uznaným športom"},"a","príspevok uznaným športom"]
[null,null,null,null,null,null,null,null,null,null,null,null,null,"b - príspevok Slovenskému olympijskému a športovému výboru","b","príspevok Slovenskému olympijskému a športovému výboru"]
[null,null,null,null,"1. VYPLŇTE ZELENÉ BUNKY\n2. VYTLAČTE, PODPÍŠTE A ODOŠLITE V LISTINNEJ PODOBE",null,null,null,null,null,null,null,null,"c - príspevok Slovenskému paralympijskému výboru","c","príspevok Slovenskému paralympijskému výboru"]
[null,null,null,null,null,null,null,null,null,null,null,null,null,"d - príspevok športovcom top tímu","d","príspevok športovcom top tímu"]
[null,null,"Ministerstvo školstva, vedy, výskumu a športu Slovenskej republiky",null,null,null,null,null,null,null,null,null,null,"e - rozvoj športov, ktoré nie sú uznanými podľa zákona č. 440/2015 Z. z.","e","rozvoj športov, ktoré nie sú uznanými podľa zákona č. 440/2015 Z. z."]
[null,null,"sekcia športu ",null,"Dátum poukázania vrátených prostriedkov:",null,null,null,null,null,null,null,null,"f - organizovanie významných a tradičných športových podujatí na území SR v roku 2020","f","organizovanie významných a tradičných športových podujatí na území SR v roku 2020"]
[null,null,"Stromová 1",null,"Suma vrátených prostriedkov (eur):",null,null,null,null,null,null,null,null,"g - projekty školského, univerzitného športu a športu pre všetkých","g","projekty školského, univerzitného športu a športu pre všetkých"]
[null,null,"813 30  Bratislava 1",null,"IBAN odosielajúceho účtu:",null,null,null,null,null,null,null,null,"h - podpora a rozvoj turistických a cykloturistických trás","h","podpora a rozvoj turistických a cykloturistických trás"]
[null,null,null,null,"IBAN určeného účtu ministerstva:",null,null,null,null,null,null,null,null,"i - finančné odmeny športovcom za výsledky dosiahnuté v roku 2019 a trénerom mládeže za dosiahnuté výsledky ich športovcov v roku 2019 a za celoživotnú prácu s mládežou","i","finančné odmeny športovcom za výsledky dosiahnuté v roku 2019 a trénerom mládeže za dosiahnuté výsledky ich športovcov v roku 2019 a za celoživotnú prácu s mládežou"]
[null,null,null,null,"Dátum odoslania AVÍZA:",null,null,null,null,null,null,null,null,"j - projekty pre popularizáciu pohybových aktivít detí, mládeže a seniorov","j","projekty pre popularizáciu pohybových aktivít detí, mládeže a seniorov"]
{"$rows_left_out":21}
{"sheet":"Skratky","index":10,"n_rows":21,"n_cols":2,"rows_kept":21,"cut":false,"hidden":false,"merged":[[1,0,1,1]]}
["Zoznam akceptovaných skratiek"]
["Pri vyúčtovaní môžete používať nasledovné skratky. Ak potrebujete, definujte ďalšie."]
["Skratka","Vysvetlenie"]
["MS","majstrovstvá sveta"]
["ME","majstrovstvá Európy"]
["SP","svetový pohár"]
["EP","európsky pohár"]
["MSR","majstrovstvá Slovenska"]
["VV","výkonný výbor"]
["ŠH","športová hala"]
{"$rows_left_out":11}